Reaction Details
TargetSerine/threonine-protein kinase pim-1
LigandBDBM206757
Substrate/Competitorn/a
Meas. Tech.PIM Kinase Binding Activity Assay
pH7.2±n/a
Ki 0.019±n/a nM
Commentsextracted
Citation Do, SHu, HKolesnikov, ALee, WTsui, VHWang, XWen, Z Pyrazolo[3,4-c]pyridine compounds and methods of use US Patent US9260425 Publication Date 2/16/2016
 
Serine/threonine-protein kinase pim-1
Name:Serine/threonine-protein kinase pim-1
Type:Protein
Mol. Mass.:35681.82
Organism:Homo sapiens (Human)
Description:P11309
Residue:313
BDBM206757
NameBDBM206757
Synonyms:US9260425, 522
TypeSmall organic molecule
Emp. Form.C21H22N8
Mol. Mass.386.453
SMILESCc1cncc(n1)-c1cc2c(n[nH]c2cn1)-c1cccc(n1)N1CCCNCC1