Reaction Details
TargetTGF-beta receptor type-1
LigandBDBM172452
Substrate/Competitorn/a
Meas. Tech.ALK-5 Kinase Assay
pH7.6±n/a
Temperature277.15±n/a K
IC50 4.33±1.51 nM
Commentsextracted
Citation Barrett, SDKramer, JBBoys, MLChen, H Therapeutic pyrazolyl thienopyridines US Patent US9260450 Publication Date 2/16/2016
 
TGF-beta receptor type-1
Name:TGF-beta receptor type-1
Type:enzyme
Mol. Mass.:55968.24
Organism:Homo sapiens (Human)
Description:P36897
Residue:503
BDBM172452
NameBDBM172452
Synonyms:US9090625, 4 US9938289, 4
TypeSmall organic molecule
Emp. Form.C18H16N4S
Mol. Mass.320.411
SMILESCCc1cnn(c1-c1cc2cnccc2s1)-c1cccc(C)n1