Reaction Details
TargetInsulin-degrading enzyme
LigandBDBM60940
Substrate/Competitorn/a
Meas. Tech.IDE Activity Assay
IC50>20000±n/a nM
Citation Liu, DRMaianti, JPSaghatelian, AKleiner, RE Macrocyclic insulin-degrading enzyme (IDE) inhibitors and uses thereof US Patent US9243038 Publication Date 1/26/2016
 
Insulin-degrading enzyme
Name:Insulin-degrading enzyme
Type:Enzyme Catalytic Domain
Mol. Mass.:117968.59
Organism:Homo sapiens (Human)
Description:P14735
Residue:1019
BDBM60940
NameBDBM60940
Synonyms:US9243038, 18 | US9243038, 23
Typen/a
Emp. Form.C36H44N6O7
Mol. Mass.672.7706
SMILESNC(=O)C1CCCCNC(=O)[C@@H](Cc2ccc(cc2)C(=O)c2ccccc2)NC(=O)[C@H](CC2CCCCC2)NC(=O)NC(=O)\C=C\C(=O)N1