Reaction Details
TargetInsulin-degrading enzyme
LigandBDBM209044
Substrate/Competitorn/a
Meas. Tech.IDE Activity Assay
IC50 3.2e+3±n/a nM
Citation Liu, DRMaianti, JPSaghatelian, AKleiner, RE Macrocyclic insulin-degrading enzyme (IDE) inhibitors and uses thereof US Patent US9243038 Publication Date 1/26/2016
 
Insulin-degrading enzyme
Name:Insulin-degrading enzyme
Type:Enzyme Catalytic Domain
Mol. Mass.:117968.59
Organism:Homo sapiens (Human)
Description:P14735
Residue:1019
BDBM209044
NameBDBM209044
Synonyms:US9243038, 19
TypeSmall organic molecule
Emp. Form.C44H52N6O7
Mol. Mass.776.9197
SMILESNC(=O)C1CCCCNC(=O)[C@@H](Cc2ccc(cc2)C(=O)c2ccccc2)NC(=O)[C@H](CC2CCCCC2)NC(=O)C(Cc2ccccc2)NC(=O)\C=C\C(=O)N1