Reaction Details
TargetBromodomain-containing protein 4 [44-168]/Histone H4
LigandBDBM209476
Substrate/Competitorn/a
Meas. Tech.AlphaScreen Assay
IC50 17±n/a nM
Citation Engelhardt, HGianni, DSmethurst, C Substituted [1,2,4]triazolo[4,3-A]pyrazines that are BRD4 inhibitors US Patent US9266891 Publication Date 2/23/2016
 
Bromodomain-containing protein 4 [44-168]/Histone H4
Name:Bromodomain-containing protein 4 [44-168]/Histone H4
Synonyms:BRD4-BD1 and Histone H4
Type:Protein
Mol. Mass.:n/a
Description:n/a
Components:This complex has 2 components.
Component 1
Name:Bromodomain-containing protein 4 [44-168]
Type:Enzyme Catalytic Domain
Mol. Mass.:14866.49
Organism:Homo sapiens (Human)
Description:aa (44-168)
Residue:125
Component 2
Name:Histone H4
Synonyms:H4-16 H4/B H4/D H4/G H4/I H4/K H4/N H4C1 H4FA H4FC H4FE H4FH H4FJ H4FM H4FO HIST1H4A HIST1H4C HIST1H4E HIST1H4H HIST1H4J HIST1H4L HIST2H4A HIST4H4 andH4/B andH4/D andH4/G andH4/I andH4/K andH4/N | andH4/O
Type:Protein
Mol. Mass.:11386.36
Organism:Homo sapiens (Human)
Description:P62805
Residue:103
BDBM209476
NameBDBM209476
Synonyms:US10328074, Example III-17 US9266891, III-17
TypeSmall organic molecule
Emp. Form.C26H30N10
Mol. Mass.482.5834
SMILESCCNc1nc(cn2c(C)nnc12)-c1nc2cnc(cc2n1Cc1ccccc1)N1CCN(C)CC1