Reaction Details
TargetCarbonic anhydrase 12
LigandBDBM210936
Substrate/Competitorn/a
Meas. Tech.CA Inhibition Assay
Ki 47±0.0 nM
Citation Bhatt, AMahon, BPCruzeiro, VWCornelio, BLaronze-Cochard, MCeruso, MSapi, JRance, GAKhlobystov, ANFontana, ARoitberg, ASupuran, CTMcKenna, R Structure-Activity Relationships of Benzenesulfonamide-Based Inhibitors towards Carbonic Anhydrase Isoform Specificity. Chembiochem18:213-222 (2017) 
 
Carbonic anhydrase 12
Name:Carbonic anhydrase 12
Type:Enzyme
Mol. Mass.:39456.00
Organism:Homo sapiens (Human)
Description:Catalytic domain of human cloned isozyme was used in the assay
Residue:354
BDBM210936
NameBDBM210936
Synonyms:4-(2-methylphenyl)-bezenesulfonamide (4b)
TypeSmall organic molecule
Emp. Form.C13H13NO2S
Mol. Mass.247.313
SMILESCc1ccccc1-c1ccc(cc1)S(N)(=O)=O