Reaction Details
TargetCarbonic anhydrase 12
LigandBDBM210937
Substrate/Competitorn/a
Meas. Tech.CA Inhibition Assay
Ki 0.6±0.0 nM
Citation Bhatt, AMahon, BPCruzeiro, VWCornelio, BLaronze-Cochard, MCeruso, MSapi, JRance, GAKhlobystov, ANFontana, ARoitberg, ASupuran, CTMcKenna, R Structure-Activity Relationships of Benzenesulfonamide-Based Inhibitors towards Carbonic Anhydrase Isoform Specificity. Chembiochem18:213-222 (2017) 
 
Carbonic anhydrase 12
Name:Carbonic anhydrase 12
Type:Enzyme
Mol. Mass.:39456.00
Organism:Homo sapiens (Human)
Description:Catalytic domain of human cloned isozyme was used in the assay
Residue:354
BDBM210937
NameBDBM210937
Synonyms:4-(3-formylphenyl)-benzenesulfonamide (4e)
TypeSmall organic molecule
Emp. Form.C13H11NO3S
Mol. Mass.261.296
SMILESNS(=O)(=O)c1ccc(cc1)-c1cccc(C=O)c1