Reaction Details
TargetNeutrophil elastase
LigandBDBM211853
Substrate/Competitorn/a
Meas. Tech.Nuetrophil Elastase Acitivty Assay
pH7.5±n/a
EC50 2±n/a nM
Commentsextracted
Citation Gnamm, COost, TPeters, SHoesch, HRies, UJ Substituted bicyclic dihydropyrimidinones and their use as inhibitors of neutrophil elastase activity US Patent US9290459 Publication Date 3/22/2016
 
Neutrophil elastase
Name:Neutrophil elastase
Type:Enzyme
Mol. Mass.:28532.38
Organism:Homo sapiens (Human)
Description:P08246
Residue:267
BDBM211853
NameBDBM211853
Synonyms:US9290459, 41.16 | US9670166, 41.16
TypeSmall organic molecule
Emp. Form.C27H23F3N4O4
Mol. Mass.524.4911
SMILESFC(F)(F)c1cccc(c1)N1C2=C(C(N(C(=O)NC3CCOCC3)C1=O)c1ccc(cc1)C#N)C(=O)CC2