Reaction Details
TargetNeutrophil elastase
LigandBDBM211932
Substrate/Competitorn/a
Meas. Tech.Nuetrophil Elastase Acitivty Assay
pH7.5±n/a
EC50 1±n/a nM
Commentsextracted
Citation Gnamm, COost, TPeters, SHoesch, HRies, UJ Substituted bicyclic dihydropyrimidinones and their use as inhibitors of neutrophil elastase activity US Patent US9290459 Publication Date 3/22/2016
 
Neutrophil elastase
Name:Neutrophil elastase
Type:Enzyme
Mol. Mass.:28532.38
Organism:Homo sapiens (Human)
Description:P08246
Residue:267
BDBM211932
NameBDBM211932
Synonyms:US9290459, 52.2 | US9670166, 52.2
TypeSmall organic molecule
Emp. Form.C24H20F2N4O3
Mol. Mass.450.4374
SMILESCCNC(=O)N1C(C2=C(CCC2=O)N(C1=O)c1cccc(c1)C(F)F)c1ccc(cc1)C#N