Reaction Details
TargetNeutrophil elastase
LigandBDBM50120439
Substrate/Competitorn/a
Meas. Tech.Nuetrophil Elastase Acitivty Assay
pH7.5±n/a
EC50<1±n/a nM
Commentsextracted
Citation Gnamm, COost, TPeters, SHoesch, HRies, UJ Substituted bicyclic dihydropyrimidinones and their use as inhibitors of neutrophil elastase activity US Patent US9290459 Publication Date 3/22/2016
 
Neutrophil elastase
Name:Neutrophil elastase
Type:Enzyme
Mol. Mass.:28532.38
Organism:Homo sapiens (Human)
Description:P08246
Residue:267
BDBM50120439
NameBDBM50120439
Synonyms:CHEMBL3617975 US9670166, 47.1
TypeSmall organic molecule
Emp. Form.C24H19F3N4O5S
Mol. Mass.532.492
SMILESCNC(=O)N1[C@@H](C2=C(CCC2=O)N(C1=O)c1cccc(c1)C(F)(F)F)c1ccc(cc1S(C)(=O)=O)C#N