Reaction Details
TargetNeutrophil elastase
LigandBDBM211886
Substrate/Competitorn/a
Meas. Tech.Nuetrophil Elastase Acitivty Assay
pH7.5±n/a
EC50 1±n/a nM
Commentsextracted
Citation Gnamm, COost, TPeters, SHoesch, HRies, UJ Substituted bicyclic dihydropyrimidinones and their use as inhibitors of neutrophil elastase activity US Patent US9290459 Publication Date 3/22/2016
 
Neutrophil elastase
Name:Neutrophil elastase
Type:Enzyme
Mol. Mass.:28532.38
Organism:Homo sapiens (Human)
Description:P08246
Residue:267
BDBM211886
NameBDBM211886
Synonyms:US9290459, 46
TypeSmall organic molecule
Emp. Form.C27H24F3N5O4S
Mol. Mass.571.571
SMILESFC(F)(F)c1cccc(c1)N1C2=C([C@H](N(C(=O)NC3CCS(=N)(=O)CC3)C1=O)c1ccc(cc1)C#N)C(=O)CC2