Reaction Details
TargetNeutrophil elastase
LigandBDBM211875
Substrate/Competitorn/a
Meas. Tech.Nuetrophil Elastase Acitivty Assay
pH7.5±n/a
EC50 1±n/a nM
Commentsextracted
Citation Gnamm, COost, TPeters, SHoesch, HRies, UJ Substituted bicyclic dihydropyrimidinones and their use as inhibitors of neutrophil elastase activity US Patent US9290459 Publication Date 3/22/2016
 
Neutrophil elastase
Name:Neutrophil elastase
Type:Enzyme
Mol. Mass.:28532.38
Organism:Homo sapiens (Human)
Description:P08246
Residue:267
BDBM211875
NameBDBM211875
Synonyms:US9290459, 42.6 | US9670166, 42.6
TypeSmall organic molecule
Emp. Form.C26H21F3N4O5
Mol. Mass.526.4639
SMILESO[C@@H]1COC[C@@H]1NC(=O)N1C(C2=C(CCC2=O)N(C1=O)c1cccc(c1)C(F)(F)F)c1ccc(cc1)C#N