Reaction Details
TargetNeutrophil elastase
LigandBDBM211889
Substrate/Competitorn/a
Meas. Tech.Nuetrophil Elastase Acitivty Assay
pH7.5±n/a
EC50<1±n/a nM
Commentsextracted
Citation Gnamm, COost, TPeters, SHoesch, HRies, UJ Substituted bicyclic dihydropyrimidinones and their use as inhibitors of neutrophil elastase activity US Patent US9290459 Publication Date 3/22/2016
 
Neutrophil elastase
Name:Neutrophil elastase
Type:Enzyme
Mol. Mass.:28532.38
Organism:Homo sapiens (Human)
Description:P08246
Residue:267
BDBM211889
NameBDBM211889
Synonyms:US9290459, 47.4 | US9670166, 47.4
TypeSmall organic molecule
Emp. Form.C26H21F3N4O5S
Mol. Mass.558.529
SMILESCS(=O)(=O)c1cc(ccc1[C@H]1N(C(=O)NC2CC2)C(=O)N(C2=C1C(=O)CC2)c1cccc(c1)C(F)(F)F)C#N