Reaction Details
TargetNeutrophil elastase
LigandBDBM211883
Substrate/Competitorn/a
Meas. Tech.Nuetrophil Elastase Acitivty Assay
pH7.5±n/a
EC50 2±n/a nM
Commentsextracted
Citation Gnamm, COost, TPeters, SHoesch, HRies, UJ Substituted bicyclic dihydropyrimidinones and their use as inhibitors of neutrophil elastase activity US Patent US9290459 Publication Date 3/22/2016
 
Neutrophil elastase
Name:Neutrophil elastase
Type:Enzyme
Mol. Mass.:28532.38
Organism:Homo sapiens (Human)
Description:P08246
Residue:267
BDBM211883
NameBDBM211883
Synonyms:US9290459, 45.4 | US9670166, 45.4
TypeSmall organic molecule
Emp. Form.C27H23F3N4O4
Mol. Mass.524.4911
SMILESO[C@H]1CCC[C@@H]1NC(=O)N1[C@@H](C2=C(CCC2=O)N(C1=O)c1cccc(c1)C(F)(F)F)c1ccc(cc1)C#N