Reaction Details
TargetNeutrophil elastase
LigandBDBM50120438
Substrate/Competitorn/a
Meas. Tech.Nuetrophil Elastase Acitivty Assay
pH7.5±n/a
EC50<1±n/a nM
Commentsextracted
Citation Gnamm, COost, TPeters, SHoesch, HRies, UJ Substituted bicyclic dihydropyrimidinones and their use as inhibitors of neutrophil elastase activity US Patent US9290459 Publication Date 3/22/2016
 
Neutrophil elastase
Name:Neutrophil elastase
Type:Enzyme
Mol. Mass.:28532.38
Organism:Homo sapiens (Human)
Description:P08246
Residue:267
BDBM50120438
NameBDBM50120438
Synonyms:CHEMBL3617974 US9670166, 23
TypeSmall organic molecule
Emp. Form.C24H17F3N4O4S
Mol. Mass.514.476
SMILESCS(=O)(=O)c1cc(ccc1[C@H]1N(CC#N)C(=O)N(C2=C1C(=O)CC2)c1cccc(c1)C(F)(F)F)C#N