Reaction Details
TargetNeutrophil elastase
LigandBDBM211812
Substrate/Competitorn/a
Meas. Tech.Nuetrophil Elastase Acitivty Assay
pH7.5±n/a
EC50 1±n/a nM
Commentsextracted
Citation Gnamm, COost, TPeters, SHoesch, HRies, UJ Substituted bicyclic dihydropyrimidinones and their use as inhibitors of neutrophil elastase activity US Patent US9290459 Publication Date 3/22/2016
 
Neutrophil elastase
Name:Neutrophil elastase
Type:Enzyme
Mol. Mass.:28532.38
Organism:Homo sapiens (Human)
Description:P08246
Residue:267
BDBM211812
NameBDBM211812
Synonyms:US9290459, 29 | US9475779, D.1A
TypeSmall organic molecule
Emp. Form.C22H17F3N4O4S
Mol. Mass.490.455
SMILESCN1[C@@H](C2=C(CCC2=O)N(C1=O)c1ccnc(c1)C(F)(F)F)c1ccc(cc1S(C)(=O)=O)C#N