Reaction Details
TargetNeutrophil elastase
LigandBDBM211763
Substrate/Competitorn/a
Meas. Tech.Nuetrophil Elastase Acitivty Assay
pH7.5±n/a
EC50 1±n/a nM
Commentsextracted
Citation Gnamm, COost, TPeters, SHoesch, HRies, UJ Substituted bicyclic dihydropyrimidinones and their use as inhibitors of neutrophil elastase activity US Patent US9290459 Publication Date 3/22/2016
 
Neutrophil elastase
Name:Neutrophil elastase
Type:Enzyme
Mol. Mass.:28532.38
Organism:Homo sapiens (Human)
Description:P08246
Residue:267
BDBM211763
NameBDBM211763
Synonyms:US9290459, 14A | US9670166, 14A
TypeSmall organic molecule
Emp. Form.C23H18F3N3O4S
Mol. Mass.489.467
SMILESCCS(=O)(=O)c1cc(ccc1[C@H]1NC(=O)N(C2=C1C(=O)CC2)c1cccc(c1)C(F)(F)F)C#N