Reaction Details
TargetNeutrophil elastase
LigandBDBM211950
Substrate/Competitorn/a
Meas. Tech.Nuetrophil Elastase Acitivty Assay
pH7.5±n/a
EC50 2±n/a nM
Commentsextracted
Citation Gnamm, COost, TPeters, SHoesch, HRies, UJ Substituted bicyclic dihydropyrimidinones and their use as inhibitors of neutrophil elastase activity US Patent US9290459 Publication Date 3/22/2016
 
Neutrophil elastase
Name:Neutrophil elastase
Type:Enzyme
Mol. Mass.:28532.38
Organism:Homo sapiens (Human)
Description:P08246
Residue:267
BDBM211950
NameBDBM211950
Synonyms:US9290459, 30B US9670166, 30B
TypeSmall organic molecule
Emp. Form.C23H18F3N3O3S
Mol. Mass.473.468
SMILESCN1[C@H](C2=C(CCC2=O)N(C1=O)c1cccc(c1)C(F)(F)F)c1ccc(cc1S(C)=O)C#N