Reaction Details
TargetNeutrophil elastase
LigandBDBM211801
Substrate/Competitorn/a
Meas. Tech.Nuetrophil Elastase Acitivty Assay
pH7.5±n/a
EC50 2±n/a nM
Commentsextracted
Citation Gnamm, COost, TPeters, SHoesch, HRies, UJ Substituted bicyclic dihydropyrimidinones and their use as inhibitors of neutrophil elastase activity US Patent US9290459 Publication Date 3/22/2016
 
Neutrophil elastase
Name:Neutrophil elastase
Type:Enzyme
Mol. Mass.:28532.38
Organism:Homo sapiens (Human)
Description:P08246
Residue:267
BDBM211801
NameBDBM211801
Synonyms:US9290459, 26A | US9670166, 26A
TypeSmall organic molecule
Emp. Form.C22H17F2N3O2
Mol. Mass.393.3861
SMILESCN1[C@@H](C2=C(CCC2=O)N(C1=O)c1cccc(c1)C(F)F)c1ccc(cc1)C#N