Reaction Details
TargetNeutrophil elastase
LigandBDBM211945
Substrate/Competitorn/a
Meas. Tech.Nuetrophil Elastase Acitivty Assay
pH7.5±n/a
EC50 3±n/a nM
Commentsextracted
Citation Gnamm, COost, TPeters, SHoesch, HRies, UJ Substituted bicyclic dihydropyrimidinones and their use as inhibitors of neutrophil elastase activity US Patent US9290459 Publication Date 3/22/2016
 
Neutrophil elastase
Name:Neutrophil elastase
Type:Enzyme
Mol. Mass.:28532.38
Organism:Homo sapiens (Human)
Description:P08246
Residue:267
BDBM211945
NameBDBM211945
Synonyms:US9290459, 55 | US9670166, 55
TypeSmall organic molecule
Emp. Form.C25H22F3N5O4
Mol. Mass.513.4685
SMILESCC(C)(O)CNC(=O)N1C(C2=C(CCC2=O)N(C1=O)c1ccnc(c1)C(F)(F)F)c1ccc(cc1)C#N