Reaction Details
TargetNeutrophil elastase
LigandBDBM211786
Substrate/Competitorn/a
Meas. Tech.Nuetrophil Elastase Acitivty Assay
pH7.5±n/a
EC50<1±n/a nM
Commentsextracted
Citation Gnamm, COost, TPeters, SHoesch, HRies, UJ Substituted bicyclic dihydropyrimidinones and their use as inhibitors of neutrophil elastase activity US Patent US9290459 Publication Date 3/22/2016
 
Neutrophil elastase
Name:Neutrophil elastase
Type:Enzyme
Mol. Mass.:28532.38
Organism:Homo sapiens (Human)
Description:P08246
Residue:267
BDBM211786
NameBDBM211786
Synonyms:US9290459, 22.4 | US9670166, 22.4
TypeSmall organic molecule
Emp. Form.C29H25F3N4O5S
Mol. Mass.598.593
SMILESCS(=O)(=O)c1cc(ccc1C1N(CC(=O)N2CC3CC3C2)C(=O)N(C2=C1C(=O)CC2)c1cccc(c1)C(F)(F)F)C#N