Reaction Details
TargetProbable salicylate monooxygenase [Y105F]
LigandBDBM50336491
Substrate/Competitorn/a
Meas. Tech.Substrate Binding Assay
pH8±n/a
Kd 6.44e+5± 5.3e+4 nM
Commentsextracted
Citation Montersino, SOrru, RBarendregt, AWestphal, AHvan Duijn, EMattevi, Avan Berkel, WJ Crystal structure of 3-hydroxybenzoate 6-hydroxylase uncovers lipid-assisted flavoprotein strategy for regioselective aromatic hydroxylation. J Biol Chem288:26235-45 (2013) 
 
Probable salicylate monooxygenase [Y105F]
Name:Probable salicylate monooxygenase [Y105F]
Synonyms:3-Hydroxybenzoate 6-hydroxylase (3HB6H Y105F)
Type:Dimeric flavoprotein
Mol. Mass.:43969.58
Organism:Rhodococcus jostii RHA1
Description:R. jostii 3HB6H mutant Y105F
Residue:399
BDBM50336491
NameBDBM50336491
TypeSmall organic molecule
Emp. Form.C7H6O3
Mol. Mass.138.1207
SMILESOC(=O)c1cccc(O)c1