Reaction Details
TargetAcetyl-CoA carboxylase 2 [129-967]
LigandBDBM212610
Substrate/Competitorn/a
Meas. Tech.Spectrophotometric 384 Well Assay
pH7.5±n/a
IC50 139±n/a nM
Commentsextracted
Citation Heine, NFleck, MNosse, BRoth, GJ Pyrrolidine derivatives, pharmaceutical compositions and uses thereof US Patent US9278954 Publication Date 3/8/2016
 
Acetyl-CoA carboxylase 2 [129-967]
Name:Acetyl-CoA carboxylase 2 [129-967]
Type:Enzyme
Mol. Mass.:92599.28
Organism:Homo sapiens (Human)
Description:O00763 lacks the 128 amino acids at the N-terminus
Residue:839
BDBM212610
NameBDBM212610
Synonyms:US9278954, 1.1 US9278954, 6.1 isomer 2
TypeSmall organic molecule
Emp. Form.C24H31ClN4O4
Mol. Mass.474.98
SMILESCC(C(=O)NC1CC1)c1ccc(O[C@@H]2CCN(C2)c2ncnc(OCC(C)(C)O)c2Cl)cc1