Reaction Details
TargetAcetyl-CoA carboxylase 2 [129-967]
LigandBDBM212611
Substrate/Competitorn/a
Meas. Tech.Spectrophotometric 384 Well Assay
pH7.5±n/a
IC50 61±n/a nM
Commentsextracted
Citation Heine, NFleck, MNosse, BRoth, GJ Pyrrolidine derivatives, pharmaceutical compositions and uses thereof US Patent US9278954 Publication Date 3/8/2016
 
Acetyl-CoA carboxylase 2 [129-967]
Name:Acetyl-CoA carboxylase 2 [129-967]
Type:Enzyme
Mol. Mass.:92599.28
Organism:Homo sapiens (Human)
Description:O00763 lacks the 128 amino acids at the N-terminus
Residue:839
BDBM212611
NameBDBM212611
Synonyms:US9278954, 1.2
TypeSmall organic molecule
Emp. Form.C24H31FN4O2
Mol. Mass.426.5269
SMILESCCCNc1nccc(N2CC[C@H](C2)Oc2ccc(cc2)C(C)C(=O)NC2CC2)c1F