Reaction Details
TargetAcetyl-CoA carboxylase 2 [129-967]
LigandBDBM212645
Substrate/Competitorn/a
Meas. Tech.Spectrophotometric 384 Well Assay
pH7.5±n/a
IC50 135±n/a nM
Commentsextracted
Citation Heine, NFleck, MNosse, BRoth, GJ Pyrrolidine derivatives, pharmaceutical compositions and uses thereof US Patent US9278954 Publication Date 3/8/2016
 
Acetyl-CoA carboxylase 2 [129-967]
Name:Acetyl-CoA carboxylase 2 [129-967]
Type:Enzyme
Mol. Mass.:92599.28
Organism:Homo sapiens (Human)
Description:O00763 lacks the 128 amino acids at the N-terminus
Residue:839
BDBM212645
NameBDBM212645
Synonyms:BDBM212750 | US9278954, 1.36
TypeSmall organic molecule
Emp. Form.C23H29ClF2N4O4
Mol. Mass.498.951
SMILESCC(C(=O)NCC(F)F)c1ccc(O[C@@H]2CCN(C2)c2ncnc(OCC(C)(C)O)c2Cl)cc1