Reaction Details
TargetC-terminal-binding protein 1 [W318F]
LigandBDBM213227
Substrate/Competitorn/a
Meas. Tech.Equilibrium Dialysis
Kd 2.2e+3±n/a nM
Citation Madison, DLWirz, JASiess, DLundblad, JR Nicotinamide adenine dinucleotide-induced multimerization of the co-repressor CtBP1 relies on a switching tryptophan. J Biol Chem288:27836-48 (2013) 
 
C-terminal-binding protein 1 [W318F]
Name:C-terminal-binding protein 1 [W318F]
Type:Protein
Mol. Mass.:47498.76
Organism:Homo sapiens (Human)
Description:Human CtBP1 W318F mutant
Residue:440
BDBM213227
NameBDBM213227
Synonyms:Nicotinamide adenine dinucleotide (NAD)
TypeSmall organic molecule
Emp. Form.C21H27N7O14P2
Mol. Mass.663.4251
SMILESNC(=O)c1ccc[n+](c1)[C@@H]1O[C@H](COP([O-])(=O)OP(O)(=O)OC[C@H]2O[C@H]([C@H](O)[C@@H]2O)n2cnc3c(N)ncnc23)[C@@H](O)[C@H]1O