Reaction Details
TargetTyrosine-protein kinase ABL1 [64-515]
LigandBDBM213593
Substrate/Competitorn/a
Meas. Tech.Caliper ABL
pH7.5±n/a
Temperature303.15±n/a K
IC50 0.2±n/a nM
Commentsextracted
Citation Furet, PGrotzfeld, RMJahnke, WJones, DBManley, PWMarzinzik, APelle, XFSalem, BSchoepfer, JSpieser, EA Compounds and compositions for inhibiting the activity of ABL1, ABL2 and BCR-ABL1 US Patent US9278981 Publication Date 3/8/2016
 
Tyrosine-protein kinase ABL1 [64-515]
Name:Tyrosine-protein kinase ABL1 [64-515]
Type:Enzyme Catalytic Domain
Mol. Mass.:51539.77
Organism:Homo sapiens (Human)
Description:aa 64-515
Residue:452
BDBM213593
NameBDBM213593
Synonyms:US9278981, 185
TypeSmall organic molecule
Emp. Form.C21H18F3N5O2S
Mol. Mass.461.46
SMILESO[C@H]1CCN(C1)c1ncc(cc1-c1cncnc1)C(=O)Nc1ccc(SC(F)(F)F)cc1