Reaction Details
TargetTyrosine-protein kinase ABL1 [64-515]
LigandBDBM213671
Substrate/Competitorn/a
Meas. Tech.Caliper ABL
pH7.5±n/a
Temperature303.15±n/a K
IC50<0.13±n/a nM
Commentsextracted
Citation Furet, PGrotzfeld, RMJahnke, WJones, DBManley, PWMarzinzik, APelle, XFSalem, BSchoepfer, JSpieser, EA Compounds and compositions for inhibiting the activity of ABL1, ABL2 and BCR-ABL1 US Patent US9278981 Publication Date 3/8/2016
 
Tyrosine-protein kinase ABL1 [64-515]
Name:Tyrosine-protein kinase ABL1 [64-515]
Type:Enzyme Catalytic Domain
Mol. Mass.:51539.77
Organism:Homo sapiens (Human)
Description:aa 64-515
Residue:452
BDBM213671
NameBDBM213671
Synonyms:US9278981, 263
TypeSmall organic molecule
Emp. Form.C22H20ClF2N5O3
Mol. Mass.475.876
SMILESCc1ncncc1-c1cc(cnc1N1CC[C@@H](O)C1)C(=O)Nc1ccc(OC(F)(F)Cl)cc1