Reaction Details
TargetTyrosine-protein kinase ABL1
LigandBDBM213656
Substrate/Competitorn/a
Meas. Tech.Cellular Proliferation Assay
IC50 9±n/a nM
Citation Furet, PGrotzfeld, RMJahnke, WJones, DBManley, PWMarzinzik, APelle, XFSalem, BSchoepfer, JSpieser, EA Compounds and compositions for inhibiting the activity of ABL1, ABL2 and BCR-ABL1 US Patent US9278981 Publication Date 3/8/2016
 
Tyrosine-protein kinase ABL1
Name:Tyrosine-protein kinase ABL1
Type:Enzyme
Mol. Mass.:122897.30
Organism:Homo sapiens (Human)
Description:P00519
Residue:1130
BDBM213656
NameBDBM213656
Synonyms:US9278981, 248
TypeSmall organic molecule
Emp. Form.C21H18ClF2N5O4
Mol. Mass.477.849
SMILESO[C@H]1CN(C[C@@H]1O)c1ncc(cc1-c1cncnc1)C(=O)Nc1ccc(OC(F)(F)Cl)cc1