Reaction Details
TargetMacrophage-stimulating protein receptor [983-1400,G1195S]
LigandBDBM213709
Substrate/Competitorn/a
Meas. Tech.Enzyme Assay
pH7.5±n/a
Temperature298.15±n/a K
IC50 10±0.0 nM
Commentsextracted
Citation Staehle, WSchadt, OKnuehl, CFriese-Hamim, MHuck, BRGoutopoulos, ABrugger, N Pyrido-pyrimidine derivatives US Patent US9283225 Publication Date 3/15/2016
 
Macrophage-stimulating protein receptor [983-1400,G1195S]
Name:Macrophage-stimulating protein receptor [983-1400,G1195S]
Type:Protein
Mol. Mass.:47287.22
Organism:Homo sapiens (Human)
Description:MST1R (RON) recombinant human protein (Life Technologies, 983-1400 aa)
Residue:418
BDBM213709
NameBDBM213709
Synonyms:US9283225, A3
TypeSmall organic molecule
Emp. Form.C24H19FN6O3
Mol. Mass.458.4445
SMILESCc1c(cnn1-c1ccccc1)C(=O)Nc1ccc(Oc2ccnc3NC(=O)NCc23)c(F)c1