Reaction Details
TargetCatenin beta-1 [138-686]
LigandBDBM213754
Substrate/Competitorn/a
Meas. Tech.Fluorescence Polarization (FP) Assay
Temperature298.15±n/a K
Ki 54200±360 nM
Commentsextracted
Citation Ji, HYu, BZhang, MGuo, W Substituted 1H-indazol-1-ol analogs as inhibitors of beta catenin/Tcf protein-protein interactions US Patent US9284299 Publication Date 3/15/2016
 
Catenin beta-1 [138-686]
Name:Catenin beta-1 [138-686]
Type:Protein
Mol. Mass.:60127.24
Organism:Homo sapiens (Human)
Description:aa 138-686
Residue:549
BDBM213754
NameBDBM213754
Synonyms:US9284299, 5
TypeSmall organic molecule
Emp. Form.C9H10N7O
Mol. Mass.232.222
SMILESOn1nnc2cc(CC[N]3=NNN=C3)ccc12