Reaction Details
TargetCatenin beta-1 [138-686]
LigandBDBM213756
Substrate/Competitorn/a
Meas. Tech.Fluorescence Polarization (FP) Assay
Temperature298.15±n/a K
Ki 24360±630 nM
Commentsextracted
Citation Ji, HYu, BZhang, MGuo, W Substituted 1H-indazol-1-ol analogs as inhibitors of beta catenin/Tcf protein-protein interactions US Patent US9284299 Publication Date 3/15/2016
 
Catenin beta-1 [138-686]
Name:Catenin beta-1 [138-686]
Type:Protein
Mol. Mass.:60127.24
Organism:Homo sapiens (Human)
Description:aa 138-686
Residue:549
BDBM213756
NameBDBM213756
Synonyms:US9284299, 7 | US9738628, Compound 14
TypeSmall organic molecule
Emp. Form.C10H9N5O2S
Mol. Mass.263.276
SMILESOn1nnc2cc(CCc3noc(=S)[nH]3)ccc12