Reaction Details
TargetCatenin beta-1 [138-686]
LigandBDBM213768
Substrate/Competitorn/a
Meas. Tech.Fluorescence Polarization (FP) Assay
Temperature298.15±n/a K
Ki 28740±860 nM
Commentsextracted
Citation Ji, HYu, BZhang, MGuo, W Substituted 1H-indazol-1-ol analogs as inhibitors of beta catenin/Tcf protein-protein interactions US Patent US9284299 Publication Date 3/15/2016
 
Catenin beta-1 [138-686]
Name:Catenin beta-1 [138-686]
Type:Protein
Mol. Mass.:60127.24
Organism:Homo sapiens (Human)
Description:aa 138-686
Residue:549
BDBM213768
NameBDBM213768
Synonyms:US9284299, 19 | US9738628, Compound 19
TypeSmall organic molecule
Emp. Form.C16H11BrFN7O2
Mol. Mass.432.207
SMILESOn1ncc2cc(ccc12)N(Cc1nn[nH]n1)C(=O)c1cc(F)cc(Br)c1