Reaction Details
TargetAdenomatous polyposis coli protein [1477-1519]/Catenin beta-1 [138-686]
LigandBDBM50094484
Substrate/Competitorn/a
Meas. Tech.AlphaScreen Assay
pH7.4±n/a
Temperature298.15±n/a K
Ki 8310±1050 nM
Commentsextracted
Citation Ji, HYu, BZhang, MGuo, W Substituted 1H-indazol-1-ol analogs as inhibitors of beta catenin/Tcf protein-protein interactions US Patent US9284299 Publication Date 3/15/2016
 
Adenomatous polyposis coli protein [1477-1519]/Catenin beta-1 [138-686]
Name:Adenomatous polyposis coli protein [1477-1519]/Catenin beta-1 [138-686]
Synonyms:Beta-catenin/APC-R3
Type:Enzyme
Mol. Mass.:n/a
Description:n/a
Components:This complex has 2 components.
Component 1
Name:Catenin beta-1 [138-686]
Type:Protein
Mol. Mass.:60127.24
Organism:Homo sapiens (Human)
Description:aa 138-686
Residue:549
Component 2
Name:Adenomatous polyposis coli protein [1477-1519]
Synonyms:APC Adenomatous polyposis coli protein (APC-R3) | DP2.5
Type:Enzyme
Mol. Mass.:4662.54
Organism:Homo sapiens (Human)
Description:Human APC-R3 truncation (1477-1519 aa)
Residue:43
BDBM50094484
NameBDBM50094484
Synonyms:CHEBI:3556 US9284299, CGP049090 | US9738628, Compound CGP049090
TypeSmall organic molecule
Emp. Form.C29H26O10
Mol. Mass.534.5107
SMILESCOc1c(C[C@H](C)O)c2c3c(C[C@H](C)O)c(OC)c(=O)c4c(O)cc5OCOc6cc(O)c(c2c6c5c34)c1=O