Reaction Details
TargetBifunctional epoxide hydrolase 2
LigandBDBM50100539
Substrate/Competitorn/a
Meas. Tech.FA
IC50 1.5±n/a nM
Citation Hammock, BDRose, TMorisseau, CLee, KS Acyl piperidine inhibitors of soluble epoxide hydrolase US Patent US9296693 Publication Date 3/29/2016
 
Bifunctional epoxide hydrolase 2
Name:Bifunctional epoxide hydrolase 2
Type:Enzyme
Mol. Mass.:62512.06
Organism:Mus musculus (Mouse)
Description:P34914
Residue:554
BDBM50100539
NameBDBM50100539
Synonyms:CHEMBL3327069
TypeSmall organic molecule
Emp. Form.C16H17F6N3O2
Mol. Mass.397.3155
SMILESFC(F)(F)CC(=O)N1CCC(CC1)NC(=O)Nc1ccc(cc1)C(F)(F)F