Reaction Details
TargetBifunctional epoxide hydrolase 2
LigandBDBM50327810
Substrate/Competitorn/a
Meas. Tech.Fluorescent Based Assay
pH7±n/a
IC50 3.9±n/a nM
Commentsextracted
Citation Hammock, BDRose, TMorisseau, CLee, KS Acyl piperidine inhibitors of soluble epoxide hydrolase US Patent US9296693 Publication Date 3/29/2016
 
Bifunctional epoxide hydrolase 2
Name:Bifunctional epoxide hydrolase 2
Type:Enzyme
Mol. Mass.:62613.07
Organism:Homo sapiens (Human)
Description:P34913
Residue:555
BDBM50327810
NameBDBM50327810
Synonyms:1-Cycloheptyl-3-(1-propionylpiperidin-4-yl)urea US9296693, 3
TypeSmall organic molecule
Emp. Form.C16H29N3O2
Mol. Mass.295.4204
SMILESCCC(=O)N1CCC(CC1)NC(=O)NC1CCCCCC1