Reaction Details
TargetBifunctional epoxide hydrolase 2
LigandBDBM100363
Substrate/Competitorn/a
Meas. Tech.Fluorescent Based Assay
pH7±n/a
IC50 1.2±n/a nM
Commentsextracted
Citation Hammock, BDRose, TMorisseau, CLee, KS Acyl piperidine inhibitors of soluble epoxide hydrolase US Patent US9296693 Publication Date 3/29/2016
 
Bifunctional epoxide hydrolase 2
Name:Bifunctional epoxide hydrolase 2
Type:Enzyme
Mol. Mass.:62512.06
Organism:Mus musculus (Mouse)
Description:P34914
Residue:554
BDBM100363
NameBDBM100363
Synonyms:US8501783, 1163 | US9296693, 2
TypeSmall organic molecule
Emp. Form.C19H31N3O2
Mol. Mass.333.4683
SMILESCCC(=O)N1CCC(CC1)NC(=O)NC12CC3CC(CC(C3)C1)C2