Reaction Details
TargetBifunctional epoxide hydrolase 2
LigandBDBM50327848
Substrate/Competitorn/a
Meas. Tech.Fluorescent Based Assay
pH7±n/a
IC50 0.7±n/a nM
Commentsextracted
Citation Hammock, BDRose, TMorisseau, CLee, KS Acyl piperidine inhibitors of soluble epoxide hydrolase US Patent US9296693 Publication Date 3/29/2016
 
Bifunctional epoxide hydrolase 2
Name:Bifunctional epoxide hydrolase 2
Type:Enzyme
Mol. Mass.:62512.06
Organism:Mus musculus (Mouse)
Description:P34914
Residue:554
BDBM50327848
NameBDBM50327848
Synonyms:1-(1-(Ethylsulfonyl)piperidin-4-yl)-3-(4-(trifluoromethoxy)phenyl)urea US10383835, Compound 2213 | US9296693, 56
TypeSmall organic molecule
Emp. Form.C15H20F3N3O4S
Mol. Mass.395.397
SMILESCCS(=O)(=O)N1CCC(CC1)NC(=O)Nc1ccc(OC(F)(F)F)cc1