Reaction Details
TargetSolute carrier organic anion transporter family member
LigandBDBM50343352
Substrate/Competitorn/a
Meas. Tech.Oatp1d1 Transport Assay
Ki 3.6e+2±n/a nM
Citation Popovic, MZaja, RFent, KSmital, T Molecular characterization of zebrafish Oatp1d1 (Slco1d1), a novel organic anion-transporting polypeptide. J Biol Chem288:33894-911 (2013) 
 
Solute carrier organic anion transporter family member
Name:Solute carrier organic anion transporter family member
Synonyms:Organic anion-transporting polypeptide 1D1 (Oatp1d1)
Type:Protein
Mol. Mass.:75011.81
Organism:Danio rerio (Zebrafish)
Description:A0A8M9PU70
Residue:689
BDBM50343352
NameBDBM50343352
TypeSmall organic molecule
Emp. Form.C19H16O4
Mol. Mass.308.3279
SMILESCC(=O)CC(c1ccccc1)c1c(O)c2ccccc2oc1=O