Reaction Details
TargetUridine 5'-monophosphate synthase
LigandBDBM214780
Substrate/Competitorn/a
Meas. Tech.Inhibition Assay
pH8±n/a
Temperature298.15±n/a K
Ki 530±200 nM
Commentsextracted
Citation Zhang, YEvans, GBClinch, KCrump, DRHarris, LDFröhlich, RFTyler, PCHazleton, KZCassera, MBSchramm, VL Transition state analogues of Plasmodium falciparum and human orotate phosphoribosyltransferases. J Biol Chem288:34746-54 (2013) 
 
Uridine 5'-monophosphate synthase
Name:Uridine 5'-monophosphate synthase
Type:Enzyme
Mol. Mass.:52224.99
Organism:Homo sapiens (Human)
Description:P11172
Residue:480
BDBM214780
NameBDBM214780
Synonyms:OPRT inhibitor, 3
TypeSmall organic molecule
Emp. Form.C10H15BrN3O5
Mol. Mass.337.147
SMILESOC[C@H]1[NH2+][C@@H](Cn2cc(Br)c(=O)[nH]c2=O)C(O)C1O