Reaction Details
TargetUridine 5'-monophosphate synthase
LigandBDBM214786
Substrate/Competitorn/a
Meas. Tech.Inhibition Assay
pH8±n/a
Temperature298.15±n/a K
Ki 80±36 nM
Commentsextracted
Citation Zhang, YEvans, GBClinch, KCrump, DRHarris, LDFröhlich, RFTyler, PCHazleton, KZCassera, MBSchramm, VL Transition state analogues of Plasmodium falciparum and human orotate phosphoribosyltransferases. J Biol Chem288:34746-54 (2013) 
 
Uridine 5'-monophosphate synthase
Name:Uridine 5'-monophosphate synthase
Type:Enzyme
Mol. Mass.:52224.99
Organism:Homo sapiens (Human)
Description:P11172
Residue:480
BDBM214786
NameBDBM214786
Synonyms:OPRT inhibitor, 9
TypeSmall organic molecule
Emp. Form.C11H17BrN3O5
Mol. Mass.351.173
SMILESOC[C@@H]1C(O)C(O)C[NH+]1CCn1cc(Br)c(=O)[nH]c1=O