Reaction Details
TargetUridine 5'-monophosphate synthase
LigandBDBM214788
Substrate/Competitorn/a
Meas. Tech.Inhibition Assay
pH8±n/a
Temperature298.15±n/a K
Ki 520±180 nM
Commentsextracted
Citation Zhang, YEvans, GBClinch, KCrump, DRHarris, LDFröhlich, RFTyler, PCHazleton, KZCassera, MBSchramm, VL Transition state analogues of Plasmodium falciparum and human orotate phosphoribosyltransferases. J Biol Chem288:34746-54 (2013) 
 
Uridine 5'-monophosphate synthase
Name:Uridine 5'-monophosphate synthase
Type:Enzyme
Mol. Mass.:52224.99
Organism:Homo sapiens (Human)
Description:P11172
Residue:480
BDBM214788
NameBDBM214788
Synonyms:OPRT inhibitor, 11
TypeSmall organic molecule
Emp. Form.C11H17BrN3O4
Mol. Mass.335.174
SMILESOC[C@H]1C[N@@H+](CCn2cc(Br)c(=O)[nH]c2=O)CC1O