Reaction Details
TargetUridine 5'-monophosphate synthase
LigandBDBM214790
Substrate/Competitorn/a
Meas. Tech.Inhibition Assay
pH8±n/a
Temperature298.15±n/a K
Ki 250±90 nM
Commentsextracted
Citation Zhang, YEvans, GBClinch, KCrump, DRHarris, LDFröhlich, RFTyler, PCHazleton, KZCassera, MBSchramm, VL Transition state analogues of Plasmodium falciparum and human orotate phosphoribosyltransferases. J Biol Chem288:34746-54 (2013) 
 
Uridine 5'-monophosphate synthase
Name:Uridine 5'-monophosphate synthase
Type:Enzyme
Mol. Mass.:52224.99
Organism:Homo sapiens (Human)
Description:P11172
Residue:480
BDBM214790
NameBDBM214790
Synonyms:OPRT inhibitor, 13
TypeSmall organic molecule
Emp. Form.C10H14N3O4
Mol. Mass.240.2353
SMILESOC(=O)c1[nH]c(=O)[nH]c(=O)c1C[NH+]1CCCC1