Reaction Details
TargetUridine 5'-monophosphate synthase
LigandBDBM214793
Substrate/Competitorn/a
Meas. Tech.Inhibition Assay
pH8±n/a
Temperature298.15±n/a K
Ki 230±90 nM
Commentsextracted
Citation Zhang, YEvans, GBClinch, KCrump, DRHarris, LDFröhlich, RFTyler, PCHazleton, KZCassera, MBSchramm, VL Transition state analogues of Plasmodium falciparum and human orotate phosphoribosyltransferases. J Biol Chem288:34746-54 (2013) 
 
Uridine 5'-monophosphate synthase
Name:Uridine 5'-monophosphate synthase
Type:Enzyme
Mol. Mass.:52224.99
Organism:Homo sapiens (Human)
Description:P11172
Residue:480
BDBM214793
NameBDBM214793
Synonyms:OPRT inhibitor, 16
TypeSmall organic molecule
Emp. Form.C11H15N2O5
Mol. Mass.255.2467
SMILESOC[C@H]1[NH2+][C@H](C(O)C1O)c1ccc(cc1)[N+]([O-])=O