Reaction Details
TargetKappa-type opioid receptor [Y119F]
LigandBDBM50001714
Substrate/Competitorn/a
Meas. Tech.[3H]Diprenorphine Competition Assay
pH7.4±n/a
Temperature298.15±n/a K
Kd 1.9±0.3 nM
Commentsextracted
Citation Vardy, EMosier, PDFrankowski, KJWu, HKatritch, VWestkaemper, RBAubé, JStevens, RCRoth, BL Chemotype-selective modes of action of ¿-opioid receptor agonists. J Biol Chem288:34470-83 (2013) 
 
Kappa-type opioid receptor [Y119F]
Name:Kappa-type opioid receptor [Y119F]
Type:Protein
Mol. Mass.:42632.76
Organism:Homo sapiens (Human)
Description:Human KOR with Y119F mutation
Residue:380
BDBM50001714
NameBDBM50001714
Synonyms:2-[3-cyclopropylmethyl-11-hydroxy-15-methoxy-(1S,2R,6S,14R,15R,16R)-13-oxa-3-azahexacyclo[13.2.2.12,8.01,6.06,14.07,12]icosa-7,9,11-trien-16-yl]-2-propanol 2-[3-cyclopropylmethyl-11-hydroxy-15-methoxy-13-oxa-3-azahexacyclo[13.2.2.12,8.01,6.06,14.07,12]icosa-7(12),8,10-trien-16-yl]-2-propanol DIPRENORPHINE-HCl | Diprenorphine
TypeSmall organic molecule
Emp. Form.C26H35NO4
Mol. Mass.425.5604
SMILESCO[C@]12CC[C@@]3(C[C@@H]1C(C)(C)O)[C@H]1Cc4ccc(O)c5O[C@@H]2[C@]3(CCN1CC1CC1)c45