Reaction Details
TargetMuscarinic acetylcholine receptor M3 [1-273,470-589,N6Q,N15Q,N41Q,N48Q,N52Q,T553C]
LigandBDBM214800
Substrate/Competitorn/a
Meas. Tech.[35S]GTPγS Binding/Immunoprecipitation Assay
Kd 1.02±0.27 nM
Citation Hu, JHu, KLiu, TStern, MKMistry, RChalliss, RACostanzi, SWess, J Novel structural and functional insights into M3 muscarinic receptor dimer/oligomer formation. J Biol Chem288:34777-90 (2013) 
 
Muscarinic acetylcholine receptor M3 [1-273,470-589,N6Q,N15Q,N41Q,N48Q,N52Q,T553C]
Name:Muscarinic acetylcholine receptor M3 [1-273,470-589,N6Q,N15Q,N41Q,N48Q,N52Q,T553C]
Type:Protein
Mol. Mass.:46048.67
Organism:Rattus norvegicus (Rat)
Description:Rat M3'(3C)-Xa with T553C mutation
Residue:405
BDBM214800
NameBDBM214800
Synonyms:N-methylscopolamine (NMS)
TypeSmall organic molecule
Emp. Form.C18H24NO4
Mol. Mass.318.3869
SMILESC[N+]1(C)[C@H]2CC(C[C@@H]1[C@H]1O[C@@H]21)OC(=O)[C@H](CO)c1ccccc1