Reaction Details
TargetDiacylglycerol O-acyltransferase 2
LigandBDBM215526
Substrate/Competitorn/a
Meas. Tech.In Vitro DGAT2 Assay
pH7.4±n/a
Temperature298.15±n/a K
IC50 165±n/a nM
Commentsextracted
Citation Ahn, KBoehm, MCabral, SCarpino, PAFutatsugi, KHepworth, DKung, DWOrr, SWang, J Diacylglycerol acyltransferase 2 inhibitors US Patent US9296745 Publication Date 3/29/2016
 
Diacylglycerol O-acyltransferase 2
Name:Diacylglycerol O-acyltransferase 2
Type:Multi-pass membrane protein
Mol. Mass.:43848.90
Organism:Homo sapiens (Human)
Description:Q96PD7
Residue:388
BDBM215526
NameBDBM215526
Synonyms:US9296745, 82
TypeSmall organic molecule
Emp. Form.C24H28N6O
Mol. Mass.416.5187
SMILESO=C([C@@H]1CCCN(C1)c1ccc2nc([nH]c2n1)C1(CC1)c1ccccn1)N1CCCC1