Reaction Details
TargetDiacylglycerol O-acyltransferase 2
LigandBDBM215528
Substrate/Competitorn/a
Meas. Tech.In Vitro DGAT2 Assay
pH7.4±n/a
Temperature298.15±n/a K
IC50 9.55±n/a nM
Commentsextracted
Citation Ahn, KBoehm, MCabral, SCarpino, PAFutatsugi, KHepworth, DKung, DWOrr, SWang, J Diacylglycerol acyltransferase 2 inhibitors US Patent US9296745 Publication Date 3/29/2016
 
Diacylglycerol O-acyltransferase 2
Name:Diacylglycerol O-acyltransferase 2
Type:Multi-pass membrane protein
Mol. Mass.:43848.90
Organism:Homo sapiens (Human)
Description:Q96PD7
Residue:388
BDBM215528
NameBDBM215528
Synonyms:US9296745, 84
TypeSmall organic molecule
Emp. Form.C22H26N6OS
Mol. Mass.422.546
SMILESO=C([C@@H]1CCCN(C1)c1ccc2nc([nH]c2n1)-c1nc(cs1)C1CC1)N1CCCC1