Reaction Details
TargetDiacylglycerol O-acyltransferase 2
LigandBDBM215579
Substrate/Competitorn/a
Meas. Tech.In Vitro DGAT2 Assay
pH7.4±n/a
Temperature298.15±n/a K
IC50 6.32±n/a nM
Commentsextracted
Citation Ahn, KBoehm, MCabral, SCarpino, PAFutatsugi, KHepworth, DKung, DWOrr, SWang, J Diacylglycerol acyltransferase 2 inhibitors US Patent US9296745 Publication Date 3/29/2016
 
Diacylglycerol O-acyltransferase 2
Name:Diacylglycerol O-acyltransferase 2
Type:Multi-pass membrane protein
Mol. Mass.:43848.90
Organism:Homo sapiens (Human)
Description:Q96PD7
Residue:388
BDBM215579
NameBDBM215579
Synonyms:US9296745, 136
TypeSmall organic molecule
Emp. Form.C23H26FN7O
Mol. Mass.435.4972
SMILESFc1cc2nc([nH]c2nc1N1CCC[C@H](C1)C(=O)N1CCCC1)-c1ccnc(n1)C1CC1