Reaction Details
TargetDiacylglycerol O-acyltransferase 2
LigandBDBM215661
Substrate/Competitorn/a
Meas. Tech.In Vitro DGAT2 Assay
pH7.4±n/a
Temperature298.15±n/a K
IC50 18.9±n/a nM
Commentsextracted
Citation Ahn, KBoehm, MCabral, SCarpino, PAFutatsugi, KHepworth, DKung, DWOrr, SWang, J Diacylglycerol acyltransferase 2 inhibitors US Patent US9296745 Publication Date 3/29/2016
 
Diacylglycerol O-acyltransferase 2
Name:Diacylglycerol O-acyltransferase 2
Type:Multi-pass membrane protein
Mol. Mass.:43848.90
Organism:Homo sapiens (Human)
Description:Q96PD7
Residue:388
BDBM215661
NameBDBM215661
Synonyms:US9296745, 199
TypeSmall organic molecule
Emp. Form.C20H25ClN8O
Mol. Mass.428.919
SMILESC[C@H](c1nc2cnc(nc2[nH]1)N1CCC[C@H](C1)C(=O)N1CCCC1)n1cc(Cl)cn1